{"text_format":"1","workbook":"xlsx","n_sheets":12,"sheets":["使用方法","Tool","部品","本_1年目_型","本_2年目_型","本_3年目_型","本_4年目_型","配_型","子_型","おとな_医充","おとな_病付","子_医療"],"not_rendered":{"charts":0,"images":9,"macros":1,"external_links":0,"defined_names":26,"comments":0,"pivot_tables":0},"unopened":[],"bounds":{"document_bytes":16777216,"sheet_cells":100000,"rows_first":2000,"rows_last":500,"rows_between":2000,"halvings":0,"cell_chars":16384,"cell_head_chars":4096},"cells_cut":0,"cells_raw":0,"read":"whole","date_system":"1900"}

{"sheet":"使用方法","index":0,"n_rows":192,"n_cols":52,"rows_kept":192,"cut":false,"hidden":false,"merged":[[182,15,183,17],[182,18,183,44],[184,15,185,44],[56,26,56,28],[56,4,56,6],[56,7,56,9],[56,12,56,14],[56,15,56,17],[56,21,56,25],[57,21,57,25],[57,26,57,28]]}
[null,null,null,null,null,null,null,null,null,null,null,null,null,null,null,null,null,null,null,null,null,null,null,null,null,null,null,null,null,null,null,null,null,null,null,null,null,null,null,null,null,null,null,null,null,null,null,null,null,null,null,"Ver1.0 (2021.8) 更改月\"5月\""]
["じちろう退職者団体生命共済【Excel版】掛金表作成・掛金試算ツールについて"]
[]
[]
[null,null,"１．用途"]
[]
[null,null,null,"続柄、（制度の）発足年、発効日を指定することで、じちろう退職者団体生命共済の掛金表を作成します。"]
[null,null,null,"また、被共済者年齢を指定し”ダブルクリック”による転記機能を用いることで、生命保障（型）と医療保障（ｺｰｽ）の掛金合計を試算できます。"]
[null,null,null,"なお、組合員本人（退職者）・配偶者の場合、じちろう退職者団体生命共済は85歳まで制度利用可能ですが、"]
[null,null,null,"本ツールでは、掛金表の作成対象を発足５年目まで、被共済者年齢は70歳までとしています。"]
[]
[]
[null,null,"２．前提"]
[]
[null,null,null,"当該県のじちろう退職者団体生命共済の更改月は”５月”です。"]
[null,null,null,"したがって、契約月数12ヵ月での契約開始は発効日”2023年5月1日”になります。"]
[null,null,null,"それ以前の発効日”2022年6月1日～2023年4月1日”の契約は、満期日”2023年4月30日”の短期契約となります。"]
[null,null,null,"なお、60歳以下の組合員本人の生命保障（型）については、経過掛金が適用されます。"]
[null,null,null,"発足年、および経過掛金の適用期間は下表の通りです。"]
[]
{"$rows_left_out":173}
{"sheet":"Tool","index":1,"n_rows":71,"n_cols":32,"rows_kept":71,"cut":false,"hidden":false,"merged":[[14,29,14,30],[63,15,63,22],[63,23,63,30],[14,25,14,26],[14,27,14,28],[43,15,43,22],[44,15,44,22],[44,23,44,30],[64,15,64,22],[64,23,64,30],[12,19,12,22],[13,19,13,20],[13,21,13,22],[14,19,14,20],[14,21,14,22],[15,21,15,22],[12,17,12,18],[15,17,15,18],[14,17,14,18],[13,17,13,18],[15,19,15,20],[15,25,15,26],[15,27,15,28],[15,29,15,30],[63,4,65,4],[63,5,65,5],[63,6,65,6],[63,13,65,13],[63,14,65,14],[43,4,45,4],[43,5,45,5],[20,13,22,13],[43,13,45,13],[20,23,20,30],[20,14,22,14],[43,14,45,14],[43,23,43,30],[43,8,45,8],[43,9,45,9],[43,10,45,10],[20,15,20,22],[21,15,21,20],[21,21,21,22],[21,23,21,28],[21,29,21,30],[5,10,5,12],[20,4,22,4],[20,5,22,5],[20,6,22,6],[20,7,22,7],[5,6,5,7],[11,8,11,9],[5,26,5,27],[5,24,5,25],[6,19,6,20],[5,15,5,21],[7,19,7,20],[6,15,6,16],[7,15,7,16],[6,24,6,25],[6,26,6,28],[12,25,12,26],[12,27,12,30],[13,25,13,26],[13,27,13,28],[13,29,13,30]]}
[null,null,null,null,null,null,null,null,null,null,null,null,null,null,null,null,null,null,null,null,null,null,null,null,null,null,null,null,null,null,null,"Ver1.0 (2021.8)"]
[null," じちろう退職者団体生命共済【Excel版】掛金表作成・掛金試算ツール",null,null,null,null,null,null,null,null,null,null,null,null,null,null,null,null,null,null,null,{"$f":" \"  \" & G6 & \"　\" & SUBSTITUTE(P6,\" \",\"\") & \"〈 契約月数：\" & V8 & \"ヵ月 〉\"","v":"  組合員本人　経過掛金１年目〈 契約月数：7ヵ月 〉"}]
[]
[null,null,null,null,null,null,null,null,null,null,null,null,null,null,null,null,null,null,null,null,null,null,null,null,null,null,null,null,null,null,null,{"$f":"\"作成日：\"&TEXT(TODAY(),\"yyyy年m月d日\")","v":"作成日：2021年11月26日"}]
[]
[null,null,null,null,null,"続 柄","組合員本人",null,null,"発 足 年","１年目",null,null,null,null,{"$f":"VLOOKUP($G$6&$K$6,部品!$B$54:C$68,2,FALSE)","v":"経 過 掛 金 １ 年 目"},null,null,null,null,null,null,null,null,"更 改 月",null,"５月発効"]
[null,null,null,null,null,null,null,null,null,null,null,null,null,null,null,"発 効 日",null,"年 齢","年齢群団","満 期 日",null,"契約月数",null,null,"在 職 時 の 制 度",null,"じちろう団体生命共済"]
[null,null,null,null,null,null,null,null,null,null,null,null,null,null,null,"2022-10-01",null,61,{"$f":"AGE_GUNDAN($G$6,$R$8)","v":"61-65歳"},{"$f":"IFERROR(VLOOKUP($K$6&$AA$6&$P$8,部品!$B$20:$F$50,5,FALSE),\"\")","v":"2023-04-30"},null,{"$f":"IFERROR(DATEDIF($P$8,$T$8,\"M\")+1,0)","v":7}]
[]
[]
[]
[null,null,null,null,null,null,null,"生年月日：","1961-07-07",null,null,null,null,null,null,null,null,"被 共 済 者 [ 男 性 ] の 年 払 い 掛 金",null,null,null,null,null,null,null,"被 共 済 者 [ 女 性 ] の 年 払 い 掛 金"]
[null,null,null,null,null,null,null,null,null,null,null,null,null,null,null,null,null,null,null,"男　性",null,null,null,null,null,null,null,"女　性"]
[null,null,null,null,null,null,null,null,null,null,null,null,null,null,null,null,null,"型 [ 型 名：掛 金 ]",null,"Ｆ 型",null,28380,null,null,null,"型 [ 型 名：掛 金 ]",null,"Ｆ 型",null,16200]
[null,null,null,null,null,null,null,null,null,null,null,null,null,null,null,null,null,"医 療 [ ｺｰｽ 名：掛 金 ]",null,"23 ｺｰｽ",null,25863,null,null,null,"医 療 [ ｺｰｽ 名：掛 金 ]",null,"23 ｺｰｽ",null,17239]
[null,null,null,null,null,null,null,null,null,null,null,null,null,null,null,null,null,"掛 金 合 計",null,null,null,{"$f":"$V$14+$V$15","v":54243},null,null,null,"掛 金 合 計",null,null,null,{"$f":"$AD$14+$AD$15","v":33439}]
[]
[]
[null,null,null,null,null,null,null,null,null,null,null,null,null,null,null,null,null,null,null,null,null,null,null,null,null,null,null,null,null,null,"口座振替年払い（7ヵ月）"]
[null,null,null,null,"保 障 額 ： 生 命 保 障（ 型 ）",null,null,null,null,null,null,null,null,"掛 金 ： 生 命 保 障（ 型 ）"]
{"$rows_left_out":52}
{"sheet":"部品","index":2,"n_rows":126,"n_cols":16,"rows_kept":126,"cut":false,"hidden":true,"merged":[]}
[]
[null,{"$f":"IF(Tool!$AA$6=\"５月発効\",\"統一\"&Tool!$K$6&\"５月\",\"統一\"&Tool!$K$6&\"４月\")","v":"統一１年目５月"}]
[]
[null,"統一１年目５月","統一１年目４月","統一２年目５月","統一２年目４月","統一３年目５月","統一３年目４月","統一４年目５月","統一４年目４月","統一５年目５月","統一５年目４月"]
[null,"2022-06-01","2022-06-01","2024-05-01","2024-04-01","2025-05-01","2025-04-01","2026-05-01","2026-04-01","2027-05-01","2027-04-01"]
[null,"2022-07-01","2022-07-01"]
[null,"2022-08-01","2022-08-01"]
[null,"2022-09-01","2022-09-01"]
[null,"2022-10-01","2022-10-01"]
[null,"2022-11-01","2022-11-01"]
[null,"2022-12-01","2022-12-01"]
[null,"2023-01-01","2023-01-01"]
[null,"2023-02-01","2023-02-01"]
[null,"2023-03-01","2023-03-01"]
[null,"2023-04-01","2023-04-01"]
[null,"2023-05-01"]
[]
[]
[null,"KEY","改正年","統一発効日","発効日","満期日"]
[null,"１年目５月発効44713","１年目","５月発効","2022-06-01","2023-04-30"]
{"$rows_left_out":107}
{"sheet":"本_1年目_型","index":3,"n_rows":305,"n_cols":31,"rows_kept":305,"cut":false,"hidden":true,"merged":[[20,23,20,30],[69,21,69,22],[69,23,69,28],[69,29,69,30],[44,14,46,14],[44,15,44,22],[44,23,44,30],[45,15,45,20],[45,21,45,22],[45,23,45,28],[45,29,45,30],[68,14,70,14],[68,4,70,4],[68,5,70,5],[68,6,70,6],[68,7,70,7],[20,13,22,13],[20,14,22,14],[21,21,21,22],[21,29,21,30],[21,15,21,20],[21,23,21,28],[68,13,70,13],[20,4,22,4],[20,5,22,5],[20,6,22,6],[44,4,46,4],[44,5,46,5],[44,6,46,6],[20,7,22,7],[44,7,46,7],[44,13,46,13],[68,15,68,22],[68,23,68,30],[69,15,69,20],[20,15,20,22],[116,14,118,14],[116,4,118,4],[116,5,118,5],[116,6,118,6],[116,7,118,7],[116,13,118,13],[92,14,94,14],[92,15,92,22],[92,23,92,30],[93,15,93,20],[93,21,93,22],[93,23,93,28],[93,29,93,30],[116,15,116,22],[116,23,116,30],[117,15,117,20],[117,21,117,22],[117,23,117,28],[117,29,117,30],[92,4,94,4],[92,5,94,5],[92,6,94,6],[92,7,94,7],[92,13,94,13],[164,14,166,14],[164,4,166,4],[164,5,166,5],[164,6,166,6],[164,7,166,7],[164,13,166,13],[140,14,142,14],[140,15,140,22],[140,23,140,30],[141,15,141,20],[141,21,141,22],[141,23,141,28],[141,29,141,30],[164,15,164,22],[164,23,164,30],[165,15,165,20],[165,21,165,22],[165,23,165,28],[165,29,165,30],[140,4,142,4],[140,5,142,5],[140,6,142,6],[140,7,142,7],[140,13,142,13],[212,14,214,14],[212,4,214,4],[212,5,214,5],[212,6,214,6],[212,7,214,7],[212,13,214,13],[188,14,190,14],[188,15,188,22],[188,23,188,30],[189,15,189,20],[189,21,189,22],[189,23,189,28],[189,29,189,30],[212,15,212,22],[212,23,212,30],[213,15,213,20],[213,21,213,22],[213,23,213,28],[213,29,213,30],[188,4,190,4],[188,5,190,5],[188,6,190,6],[188,7,190,7],[188,13,190,13],[236,23,236,30],[237,15,237,20],[237,21,237,22],[237,23,237,28],[237,29,237,30],[260,15,260,22],[260,23,260,30],[261,15,261,20],[261,21,261,22],[261,23,261,28],[261,29,261,30],[260,14,262,14],[260,4,262,4],[260,5,262,5],[260,6,262,6],[260,7,262,7],[284,14,286,14],[260,13,262,13],[236,14,238,14],[236,15,236,22],[236,4,238,4],[236,5,238,5],[236,6,238,6],[236,7,238,7],[236,13,238,13],[284,15,284,22],[284,23,284,30],[285,15,285,20],[285,21,285,22],[285,23,285,28],[285,29,285,30],[284,4,286,4],[284,5,286,5],[284,6,286,6],[284,7,286,7],[284,13,286,13]]}
[]
[]
[]
[null,null,null,null,null,"続柄","組合員本人"]
[null,null,null,null,null,"経過措置／本則","経過掛金"]
[null,null,null,null,null,"改正年","１年目"]
[null,null,null,null,null,"契約月数","12ヵ月～1ヵ月"]
[]
[]
[]
[]
[]
[]
[]
[]
[]
[]
[]
[]
[null,null,null,null,"保 障 額 ： 生 命 保 障（ 型 ）",null,null,null,null,null,null,null,null,"掛 金 ： 生 命 保 障（ 型 ）"]
{"$rows_left_out":286}
{"sheet":"本_2年目_型","index":4,"n_rows":41,"n_cols":31,"rows_kept":41,"cut":false,"hidden":true,"merged":[[20,15,20,22],[20,23,20,30],[21,15,21,20],[21,21,21,22],[21,23,21,28],[21,29,21,30],[20,14,22,14],[20,4,22,4],[20,5,22,5],[20,6,22,6],[20,7,22,7],[20,13,22,13]]}
[]
[]
[]
[null,null,null,null,null,"続柄","組合員本人"]
[null,null,null,null,null,"経過措置／本則","経過掛金"]
[null,null,null,null,null,"改正年",2]
[null,null,null,null,null,"契約月数","12ヵ月"]
[]
[]
[]
[]
[]
[]
[]
[]
[]
[]
[]
[]
[null,null,null,null,"保 障 額 ： 生 命 保 障（ 型 ）",null,null,null,null,null,null,null,null,"掛 金 ： 生 命 保 障（ 型 ）"]
{"$rows_left_out":22}
{"sheet":"本_3年目_型","index":5,"n_rows":41,"n_cols":31,"rows_kept":41,"cut":false,"hidden":true,"merged":[[20,15,20,22],[20,23,20,30],[21,15,21,20],[21,21,21,22],[21,23,21,28],[21,29,21,30],[20,14,22,14],[20,4,22,4],[20,5,22,5],[20,6,22,6],[20,7,22,7],[20,13,22,13]]}
[]
[]
[]
[null,null,null,null,null,"続柄","組合員本人"]
[null,null,null,null,null,"経過措置／本則","経過掛金"]
[null,null,null,null,null,"改正年",3]
[null,null,null,null,null,"契約月数","12ヵ月"]
[]
[]
[]
[]
[]
[]
[]
[]
[]
[]
[]
[]
[null,null,null,null,"保 障 額 ： 生 命 保 障（ 型 ）",null,null,null,null,null,null,null,null,"掛 金 ： 生 命 保 障（ 型 ）"]
{"$rows_left_out":22}
{"sheet":"本_4年目_型","index":6,"n_rows":41,"n_cols":31,"rows_kept":41,"cut":false,"hidden":true,"merged":[[20,15,20,22],[20,23,20,30],[21,15,21,22],[21,23,21,30],[20,4,22,4],[20,5,22,5],[20,6,22,6],[20,7,22,7],[20,13,22,13],[20,14,22,14]]}
[]
[]
[]
[null,null,null,null,null,"続柄","組合員本人"]
[null,null,null,null,null,"経過措置／本則","本則適用"]
[null,null,null,null,null,"改正年",4]
[null,null,null,null,null,"契約月数","12ヵ月"]
[]
[]
[]
[]
[]
[]
[]
[]
[]
[]
[]
[]
[null,null,null,null,"保 障 額 ： 生 命 保 障（ 型 ）",null,null,null,null,null,null,null,null,"掛 金 ： 生 命 保 障（ 型 ）"]
{"$rows_left_out":22}
{"sheet":"配_型","index":7,"n_rows":301,"n_cols":31,"rows_kept":301,"cut":false,"hidden":true,"merged":[[20,15,20,22],[20,23,20,30],[21,15,21,22],[21,23,21,30],[44,15,44,22],[44,23,44,30],[45,15,45,22],[45,23,45,30],[20,4,22,4],[20,5,22,5],[20,6,22,6],[20,7,22,7],[20,13,22,13],[20,14,22,14],[44,4,46,4],[44,5,46,5],[44,6,46,6],[44,7,46,7],[44,13,46,13],[44,14,46,14],[68,4,70,4],[68,5,70,5],[68,6,70,6],[68,7,70,7],[68,13,70,13],[68,14,70,14],[68,15,68,22],[68,23,68,30],[69,15,69,22],[69,23,69,30],[92,4,94,4],[92,5,94,5],[92,6,94,6],[92,7,94,7],[92,13,94,13],[92,14,94,14],[92,15,92,22],[92,23,92,30],[93,15,93,22],[93,23,93,30],[116,4,118,4],[116,5,118,5],[116,6,118,6],[116,7,118,7],[116,13,118,13],[116,14,118,14],[116,15,116,22],[116,23,116,30],[117,15,117,22],[117,23,117,30],[140,4,142,4],[140,5,142,5],[140,6,142,6],[140,7,142,7],[140,13,142,13],[140,14,142,14],[140,15,140,22],[140,23,140,30],[141,15,141,22],[141,23,141,30],[164,4,166,4],[164,5,166,5],[164,6,166,6],[164,7,166,7],[164,13,166,13],[164,14,166,14],[164,15,164,22],[164,23,164,30],[165,15,165,22],[165,23,165,30],[188,4,190,4],[188,5,190,5],[188,6,190,6],[188,7,190,7],[188,13,190,13],[188,14,190,14],[188,15,188,22],[188,23,188,30],[189,15,189,22],[189,23,189,30],[236,15,236,22],[236,23,236,30],[237,15,237,22],[237,23,237,30],[212,4,214,4],[212,5,214,5],[212,6,214,6],[212,7,214,7],[212,13,214,13],[212,14,214,14],[236,4,238,4],[236,5,238,5],[236,6,238,6],[236,7,238,7],[236,13,238,13],[236,14,238,14],[212,15,212,22],[212,23,212,30],[213,15,213,22],[213,23,213,30],[284,4,286,4],[284,5,286,5],[284,6,286,6],[284,7,286,7],[284,13,286,13],[284,14,286,14],[284,15,284,22],[284,23,284,30],[285,15,285,22],[285,23,285,30],[260,15,260,22],[260,23,260,30],[261,15,261,22],[261,23,261,30],[260,4,262,4],[260,5,262,5],[260,6,262,6],[260,7,262,7],[260,13,262,13],[260,14,262,14]]}
[]
[]
[]
[null,null,null,null,null,"続柄","配偶者"]
[null,null,null,null,null,"経過措置／本則","本則適用"]
[null,null,null,null,null,"改正年","共通"]
[null,null,null,null,null,"契約月数","12ヵ月~1ヵ月"]
[]
[]
[]
[]
[]
[]
[]
[]
[]
[]
[]
[]
[null,null,null,null,"保 障 額 ： 生 命 保 障（ 型 ）",null,null,null,null,null,null,null,null,"掛 金 ： 生 命 保 障（ 型 ）"]
{"$rows_left_out":282}
{"sheet":"子_型","index":8,"n_rows":297,"n_cols":16,"rows_kept":297,"cut":false,"hidden":true,"merged":[[20,23,20,30],[21,21,21,22],[21,23,21,28],[21,29,21,30],[44,23,44,30],[45,21,45,22],[45,23,45,28],[45,29,45,30],[20,4,22,4],[20,5,22,5],[20,6,22,6],[20,7,22,7],[20,13,22,13],[20,14,22,14],[44,4,46,4],[44,5,46,5],[44,6,46,6],[44,7,46,7],[44,13,46,13],[44,14,46,14],[68,4,70,4],[68,5,70,5],[68,6,70,6],[68,7,70,7],[68,13,70,13],[68,14,70,14],[68,23,68,30],[69,21,69,22],[69,23,69,28],[69,29,69,30],[92,4,94,4],[92,5,94,5],[92,6,94,6],[92,7,94,7],[92,13,94,13],[92,14,94,14],[92,23,92,30],[93,21,93,22],[93,23,93,28],[93,29,93,30],[116,4,118,4],[116,5,118,5],[116,6,118,6],[116,7,118,7],[116,13,118,13],[116,14,118,14],[116,23,116,30],[117,21,117,22],[117,23,117,28],[117,29,117,30],[140,4,142,4],[140,5,142,5],[140,6,142,6],[140,7,142,7],[140,13,142,13],[140,14,142,14],[140,23,140,30],[141,21,141,22],[141,23,141,28],[141,29,141,30],[164,4,166,4],[164,5,166,5],[164,6,166,6],[164,7,166,7],[164,13,166,13],[164,14,166,14],[164,23,164,30],[165,21,165,22],[165,23,165,28],[165,29,165,30],[188,4,190,4],[188,5,190,5],[188,6,190,6],[188,7,190,7],[188,13,190,13],[188,14,190,14],[188,23,188,30],[189,21,189,22],[189,23,189,28],[189,29,189,30],[236,23,236,30],[237,21,237,22],[237,23,237,28],[237,29,237,30],[212,4,214,4],[212,5,214,5],[212,6,214,6],[212,7,214,7],[212,13,214,13],[212,14,214,14],[236,4,238,4],[236,5,238,5],[236,6,238,6],[236,7,238,7],[236,13,238,13],[236,14,238,14],[212,23,212,30],[213,21,213,22],[213,23,213,28],[213,29,213,30],[284,4,286,4],[284,5,286,5],[284,6,286,6],[284,7,286,7],[284,13,286,13],[284,14,286,14],[284,23,284,30],[285,21,285,22],[285,23,285,28],[285,29,285,30],[260,23,260,30],[261,21,261,22],[261,23,261,28],[261,29,261,30],[260,4,262,4],[260,5,262,5],[260,6,262,6],[260,7,262,7],[260,13,262,13],[260,14,262,14]]}
[]
[]
[]
[null,null,null,null,null,"続柄","子ども"]
[null,null,null,null,null,"経過措置／本則","本則適用"]
[null,null,null,null,null,"改正年","共通"]
[null,null,null,null,null,"契約月数","12ヵ月～1ヵ月"]
[]
[]
[]
[]
[]
[]
[]
[]
[]
[]
[]
[]
[null,null,null,null,"保 障 額 ： 生 命 保 障（ 型 ）",null,null,null,null,null,null,null,null,"掛 金 ： 生 命 保 障（ 型 ）"]
{"$rows_left_out":278}
{"sheet":"おとな_医充","index":9,"n_rows":292,"n_cols":31,"rows_kept":292,"cut":false,"hidden":true,"merged":[[274,13,276,13],[274,14,276,14],[274,15,274,22],[274,23,274,30],[275,15,275,22],[275,23,275,30],[253,14,255,14],[253,15,253,22],[253,23,253,30],[254,15,254,22],[254,23,254,30],[253,13,255,13],[274,4,276,4],[274,5,276,5],[274,8,276,8],[274,9,276,9],[274,10,276,10],[253,4,255,4],[253,5,255,5],[253,8,255,8],[253,9,255,9],[253,10,255,10],[232,13,234,13],[232,14,234,14],[232,15,232,22],[232,23,232,30],[233,15,233,22],[233,23,233,30],[211,14,213,14],[211,15,211,22],[211,23,211,30],[212,15,212,22],[212,23,212,30],[211,13,213,13],[232,4,234,4],[232,5,234,5],[232,8,234,8],[232,9,234,9],[232,10,234,10],[211,4,213,4],[211,5,213,5],[211,8,213,8],[211,9,213,9],[211,10,213,10],[190,13,192,13],[190,14,192,14],[190,15,190,22],[190,23,190,30],[191,15,191,22],[191,23,191,30],[169,14,171,14],[169,15,169,22],[169,23,169,30],[170,15,170,22],[170,23,170,30],[169,13,171,13],[190,4,192,4],[190,5,192,5],[190,8,192,8],[190,9,192,9],[190,10,192,10],[169,4,171,4],[169,5,171,5],[169,8,171,8],[169,9,171,9],[169,10,171,10],[148,13,150,13],[148,14,150,14],[148,15,148,22],[148,23,148,30],[149,15,149,22],[149,23,149,30],[127,14,129,14],[127,15,127,22],[127,23,127,30],[128,15,128,22],[128,23,128,30],[127,13,129,13],[148,4,150,4],[148,5,150,5],[148,8,150,8],[148,9,150,9],[148,10,150,10],[127,4,129,4],[127,5,129,5],[127,8,129,8],[127,9,129,9],[127,10,129,10],[106,13,108,13],[106,14,108,14],[106,15,106,22],[106,23,106,30],[107,15,107,22],[107,23,107,30],[85,14,87,14],[85,15,85,22],[85,23,85,30],[86,15,86,22],[86,23,86,30],[85,13,87,13],[106,4,108,4],[106,5,108,5],[106,8,108,8],[106,9,108,9],[106,10,108,10],[85,4,87,4],[85,5,87,5],[85,8,87,8],[85,9,87,9],[85,10,87,10],[64,13,66,13],[64,14,66,14],[64,15,64,22],[64,23,64,30],[65,15,65,22],[65,23,65,30],[43,14,45,14],[43,15,43,22],[43,23,43,30],[44,15,44,22],[44,23,44,30],[43,13,45,13],[64,4,66,4],[64,5,66,5],[64,8,66,8],[64,9,66,9],[64,10,66,10],[43,4,45,4],[43,5,45,5],[43,8,45,8],[43,9,45,9],[43,10,45,10]]}
[]
[]
[]
[null,null,null,null,null,"続柄","本人／配偶者"]
[null,null,null,null,null,"経過措置／本則","本則"]
[]
[null,null,null,null,null,"契約月数","12ヵ月～1ヵ月"]
[]
[]
[]
[]
[]
[]
[]
[]
[]
[]
[]
[]
[]
{"$rows_left_out":273}
{"sheet":"おとな_病付","index":10,"n_rows":192,"n_cols":31,"rows_kept":192,"cut":false,"hidden":true,"merged":[[184,4,186,4],[184,5,186,5],[184,6,186,6],[184,13,186,13],[184,14,186,14],[184,15,184,22],[184,23,184,30],[185,15,185,22],[185,23,185,30],[163,15,163,22],[163,23,163,30],[173,4,175,4],[173,5,175,5],[173,6,175,6],[173,13,175,13],[173,14,175,14],[173,15,173,22],[173,23,173,30],[174,15,174,22],[162,4,164,4],[162,5,164,5],[162,6,164,6],[162,13,164,13],[162,14,164,14],[162,15,162,22],[162,23,162,30],[174,23,174,30],[151,4,153,4],[151,5,153,5],[151,6,153,6],[151,13,153,13],[151,14,153,14],[151,15,151,22],[151,23,151,30],[152,15,152,22],[152,23,152,30],[140,4,142,4],[140,5,142,5],[140,6,142,6],[140,13,142,13],[140,14,142,14],[140,15,140,22],[140,23,140,30],[141,15,141,22],[141,23,141,30],[119,15,119,22],[119,23,119,30],[129,4,131,4],[129,5,131,5],[129,6,131,6],[129,13,131,13],[129,14,131,14],[129,15,129,22],[129,23,129,30],[130,15,130,22],[118,4,120,4],[118,5,120,5],[118,6,120,6],[118,13,120,13],[118,14,120,14],[118,15,118,22],[118,23,118,30],[130,23,130,30],[107,4,109,4],[107,5,109,5],[107,6,109,6],[107,13,109,13],[107,14,109,14],[107,15,107,22],[107,23,107,30],[108,15,108,22],[108,23,108,30],[96,4,98,4],[96,5,98,5],[96,6,98,6],[96,13,98,13],[96,14,98,14],[96,15,96,22],[96,23,96,30],[97,15,97,22],[97,23,97,30],[75,15,75,22],[75,23,75,30],[85,4,87,4],[85,5,87,5],[85,6,87,6],[85,13,87,13],[85,14,87,14],[85,15,85,22],[85,23,85,30],[86,15,86,22],[74,4,76,4],[74,5,76,5],[74,6,76,6],[74,13,76,13],[74,14,76,14],[74,15,74,22],[74,23,74,30],[86,23,86,30],[63,4,65,4],[63,5,65,5],[63,6,65,6],[63,13,65,13],[63,14,65,14],[63,15,63,22],[63,23,63,30],[64,15,64,22],[64,23,64,30]]}
[]
[]
[]
[null,null,null,null,null,"続柄","本人／配偶者"]
[null,null,null,null,null,"経過措置／本則","本則"]
[]
[null,null,null,null,null,"契約月数","12ヵ月～1ヵ月"]
[]
[]
[]
[]
[]
[]
[]
[]
[]
[]
[]
[]
[]
{"$rows_left_out":173}
{"sheet":"子_医療","index":11,"n_rows":292,"n_cols":16,"rows_kept":292,"cut":false,"hidden":true,"merged":[[253,14,255,14],[253,23,253,30],[254,21,254,22],[254,23,254,28],[254,29,254,30],[253,13,255,13],[274,13,276,13],[274,14,276,14],[274,23,274,30],[275,21,275,22],[275,23,275,28],[275,29,275,30],[274,4,276,4],[274,5,276,5],[274,8,276,8],[274,9,276,9],[274,10,276,10],[253,4,255,4],[253,5,255,5],[253,8,255,8],[253,9,255,9],[253,10,255,10],[211,14,213,14],[211,23,211,30],[212,21,212,22],[212,23,212,28],[212,29,212,30],[211,13,213,13],[232,13,234,13],[232,14,234,14],[232,23,232,30],[233,21,233,22],[233,23,233,28],[233,29,233,30],[232,4,234,4],[232,5,234,5],[232,8,234,8],[232,9,234,9],[232,10,234,10],[211,4,213,4],[211,5,213,5],[211,8,213,8],[211,9,213,9],[211,10,213,10],[169,14,171,14],[169,23,169,30],[170,21,170,22],[170,23,170,28],[170,29,170,30],[169,13,171,13],[190,13,192,13],[190,14,192,14],[190,23,190,30],[191,21,191,22],[191,23,191,28],[191,29,191,30],[190,4,192,4],[190,5,192,5],[190,8,192,8],[190,9,192,9],[190,10,192,10],[169,4,171,4],[169,5,171,5],[169,8,171,8],[169,9,171,9],[169,10,171,10],[127,14,129,14],[127,23,127,30],[128,21,128,22],[128,23,128,28],[128,29,128,30],[127,13,129,13],[148,13,150,13],[148,14,150,14],[148,23,148,30],[149,21,149,22],[149,23,149,28],[149,29,149,30],[148,4,150,4],[148,5,150,5],[148,8,150,8],[148,9,150,9],[148,10,150,10],[127,4,129,4],[127,5,129,5],[127,8,129,8],[127,9,129,9],[127,10,129,10],[85,14,87,14],[85,23,85,30],[86,21,86,22],[86,23,86,28],[86,29,86,30],[85,13,87,13],[106,13,108,13],[106,14,108,14],[106,23,106,30],[107,21,107,22],[107,23,107,28],[107,29,107,30],[106,4,108,4],[106,5,108,5],[106,8,108,8],[106,9,108,9],[106,10,108,10],[85,4,87,4],[85,5,87,5],[85,8,87,8],[85,9,87,9],[85,10,87,10],[43,14,45,14],[43,23,43,30],[44,21,44,22],[44,23,44,28],[44,29,44,30],[43,13,45,13],[64,13,66,13],[64,14,66,14],[64,23,64,30],[65,21,65,22],[65,23,65,28],[65,29,65,30],[64,4,66,4],[64,5,66,5],[64,8,66,8],[64,9,66,9],[64,10,66,10],[43,4,45,4],[43,5,45,5],[43,8,45,8],[43,9,45,9],[43,10,45,10]]}
[]
[]
[]
[null,null,null,null,null,"続柄","子ども"]
[null,null,null,null,null,"経過措置／本則","本則適用"]
[null,null,null,null,null,"改正年","共通"]
[null,null,null,null,null,"契約月数","12ヵ月～1ヵ月"]
[]
[]
[]
[]
[]
[]
[]
[]
[]
[]
[]
[]
[]
{"$rows_left_out":272}